Fix legitimatePropertyLease protocols (bankAccounts).

Status Name Job ID Coverage
  Lint
passed code-style-check #118625
kube

00:00:06

passed helm-lint #118626
kube

00:00:05

 
  Build
passed build-new-image #118627
kube

00:00:13

 
  Test
failed test-integration #118628

00:00:15

passed test-unit #118629

00:00:09

 
  Publish
skipped publish-coverage-report #118630
kube
 
  Deploy
skipped deploy-demo #118631
kube allowed to fail manual
 
  Cleanup
passed cleanup-test-images #118632
kube

00:00:07

 
Name Stage Failure
failed
test-integration Test
-- Docs: https://docs.pytest.org/en/stable/warnings.html


=========================== short test summary info ============================
FAILED test/integration/test_api.py::TestApi::test_get_other_protocol_html[legitimatePropertyLease-dutch-complete]
FAILED test/integration/test_api.py::TestApi::test_get_other_protocol_html[legitimatePropertyLease-english-complete]
================== 2 failed, 57 passed, 60 warnings in 6.51s ===================
make: *** [Makefile:45: test-integration] Error 1
ERROR: Job failed: command terminated with exit code 1